Installer drivers rtl8187 sous Ubuntu (Page 1) / Crack de clef wep / Forum d'entraide: tuto-fr.com

Annonce

Visitez la boutique Wifi-highpower.com, votre revendeur agr Alfa Network: du matriel Wifi slectionn, cartes Wifi USB Awus036h et Awus036nh, antennes omnis, yagis, panel, amplis wifi, accessoires...

#1 12-04-2007 16:30:55

guigui_cosmos
Membre
Inscription : 14-01-2007
Messages : 137

Installer drivers rtl8187 sous Ubuntu

Voilà gros problème d'instalation des drivers sous Ubuntu, ou même aircrack-ng

Voilà ce que ça donne avec les drivers, qu'ils soient patchés ou non

src/aircrack-ng.c:1002: error: ‘sum’ undeclared (first use in this function)
src/aircrack-ng.c:1002: error: ‘len’ undeclared (first use in this function)
src/aircrack-ng.c:1004: warning: implicit declaration of function ‘write’
src/aircrack-ng.c:1006: error: ‘errno’ undeclared (first use in this function)
src/aircrack-ng.c:1006: error: ‘EINTR’ undeclared (first use in this function)
src/aircrack-ng.c: In function ‘crack_wep_thread’:
src/aircrack-ng.c:1036: error: too many arguments to function ‘safe_read’
src/aircrack-ng.c:1039: error: ‘SIGTERM’ undeclared (first use in this function)
src/aircrack-ng.c:1040: warning: incompatible implicit declaration of built-in function ‘_exit’
src/aircrack-ng.c:1048: warning: incompatible implicit declaration of built-in function ‘memcpy’
src/aircrack-ng.c:1049: warning: incompatible implicit declaration of built-in function ‘memset’
src/aircrack-ng.c:1222: error: too many arguments to function ‘safe_write’
src/aircrack-ng.c:1226: warning: incompatible implicit declaration of built-in function ‘_exit’
src/aircrack-ng.c: In function ‘show_wep_stats’:
src/aircrack-ng.c:1238: error: storage size of ‘ws’ isn’t known
src/aircrack-ng.c:1242: warning: implicit declaration of function ‘ioctl’
src/aircrack-ng.c:1242: error: ‘TIOCGWINSZ’ undeclared (first use in this function)
src/aircrack-ng.c:1263: error: ‘struct options’ has no member named ‘l33t’
src/aircrack-ng.c:1264: warning: incompatible implicit declaration of built-in function ‘printf’
src/aircrack-ng.c:1269: error: ‘struct options’ has no member named ‘l33t’
src/aircrack-ng.c:1270: warning: incompatible implicit declaration of built-in function ‘printf’
src/aircrack-ng.c:1275: error: ‘struct options’ has no member named ‘l33t’
src/aircrack-ng.c:1281: error: ‘struct options’ has no member named ‘l33t’
src/aircrack-ng.c:1290: error: ‘struct options’ has no member named ‘l33t’
src/aircrack-ng.c:1303: error: ‘struct options’ has no member named ‘l33t’
src/aircrack-ng.c:1311: error: ‘struct options’ has no member named ‘l33t’
src/aircrack-ng.c:1320: error: ‘struct options’ has no member named ‘showASCII’
src/aircrack-ng.c:1238: warning: unused variable ‘ws’
src/aircrack-ng.c: In function ‘check_wep_key’:
src/aircrack-ng.c:1352: warning: incompatible implicit declaration of built-in function ‘memcpy’
src/aircrack-ng.c:1356: error: ‘struct options’ has no member named ‘dict’
src/aircrack-ng.c:1401: warning: incompatible implicit declaration of built-in function ‘printf’
src/aircrack-ng.c:1406: error: ‘struct options’ has no member named ‘l33t’
src/aircrack-ng.c:1434: error: ‘struct options’ has no member named ‘l33t’
src/aircrack-ng.c: In function ‘calc_poll’:
src/aircrack-ng.c:1468: error: too many arguments to function ‘safe_write’
src/aircrack-ng.c:1471: error: ‘SIGTERM’ undeclared (first use in this function)
src/aircrack-ng.c:1472: warning: incompatible implicit declaration of built-in function ‘_exit’
src/aircrack-ng.c:1488: error: too many arguments to function ‘safe_read’
src/aircrack-ng.c:1492: warning: incompatible implicit declaration of built-in function ‘_exit’
src/aircrack-ng.c:1536: warning: implicit declaration of function ‘qsort’
src/aircrack-ng.c: In function ‘update_ivbuf’:
src/aircrack-ng.c:1552: error: ‘NULL’ undeclared (first use in this function)
src/aircrack-ng.c:1588: warning: assignment makes pointer from integer without a cast
src/aircrack-ng.c:1591: error: ‘SIGTERM’ undeclared (first use in this function)
src/aircrack-ng.c:1592: warning: incompatible implicit declaration of built-in function ‘_exit’
src/aircrack-ng.c:1595: warning: incompatible implicit declaration of built-in function ‘memcpy’
src/aircrack-ng.c: In function ‘do_wep_crack1’:
src/aircrack-ng.c:1631: error: ‘struct options’ has no member named ‘no_stdin’
src/aircrack-ng.c:1633: warning: incompatible implicit declaration of built-in function ‘printf’
src/aircrack-ng.c:1636: error: ‘SIGTERM’ undeclared (first use in this function)
src/aircrack-ng.c:1637: warning: incompatible implicit declaration of built-in function ‘_exit’
src/aircrack-ng.c:1641: warning: incompatible implicit declaration of built-in function ‘printf’
src/aircrack-ng.c:1643: warning: implicit declaration of function ‘fflush’
src/aircrack-ng.c:1643: error: ‘stdout’ undeclared (first use in this function)
src/aircrack-ng.c:1645: warning: implicit declaration of function ‘sleep’
src/aircrack-ng.c:1755: error: too many arguments to function ‘safe_write’
src/aircrack-ng.c:1759: warning: incompatible implicit declaration of built-in function ‘_exit’
src/aircrack-ng.c:1768: warning: incompatible implicit declaration of built-in function ‘memcpy’
src/aircrack-ng.c: In function ‘do_wep_crack2’:
src/aircrack-ng.c:1802: warning: incompatible implicit declaration of built-in function ‘printf’
src/aircrack-ng.c:1806: error: ‘SIGTERM’ undeclared (first use in this function)
src/aircrack-ng.c:1807: warning: incompatible implicit declaration of built-in function ‘_exit’
src/aircrack-ng.c: In function ‘inner_bruteforcer_thread’:
src/aircrack-ng.c:1877: error: ‘size_t’ undeclared (first use in this function)
src/aircrack-ng.c:1877: error: expected ‘;’ before ‘nthread’
src/aircrack-ng.c:1886: error: ‘nthread’ undeclared (first use in this function)
src/aircrack-ng.c:1886: error: too many arguments to function ‘safe_read’
src/aircrack-ng.c:1889: error: ‘SIGTERM’ undeclared (first use in this function)
src/aircrack-ng.c:1890: warning: incompatible implicit declaration of built-in function ‘_exit’
src/aircrack-ng.c:1874: warning: unused parameter ‘arg’
src/aircrack-ng.c: In function ‘calc_pmk’:
src/aircrack-ng.c:1936: warning: implicit declaration of function ‘strlen’
src/aircrack-ng.c:1936: warning: incompatible implicit declaration of built-in function ‘strlen’
src/aircrack-ng.c:1940: warning: incompatible implicit declaration of built-in function ‘memset’
src/aircrack-ng.c:1941: warning: implicit declaration of function ‘strncpy’
src/aircrack-ng.c:1941: warning: incompatible implicit declaration of built-in function ‘strncpy’
src/aircrack-ng.c:1960: warning: incompatible implicit declaration of built-in function ‘memcpy’
src/aircrack-ng.c: In function ‘crack_wpa_thread’:
src/aircrack-ng.c:2017: warning: incompatible implicit declaration of built-in function ‘memset’
src/aircrack-ng.c:2019: error: too many arguments to function ‘safe_read’
src/aircrack-ng.c:2022: error: ‘SIGTERM’ undeclared (first use in this function)
src/aircrack-ng.c:2023: warning: incompatible implicit declaration of built-in function ‘_exit’
src/aircrack-ng.c:2026: warning: incompatible implicit declaration of built-in function ‘strlen’
src/aircrack-ng.c:2035: error: too many arguments to function ‘safe_read’
src/aircrack-ng.c:2036: error: too many arguments to function ‘safe_read’
src/aircrack-ng.c:2040: warning: incompatible implicit declaration of built-in function ‘_exit’
src/aircrack-ng.c:2183: error: too many arguments to function ‘safe_write’
src/aircrack-ng.c:2184: error: too many arguments to function ‘safe_write’
src/aircrack-ng.c:2185: error: too many arguments to function ‘safe_write’
src/aircrack-ng.c:2186: error: too many arguments to function ‘safe_write’
src/aircrack-ng.c:2190: warning: incompatible implicit declaration of built-in function ‘_exit’
src/aircrack-ng.c: In function ‘show_wpa_stats’:
src/aircrack-ng.c:2221: error: invalid use of undefined type ‘struct timeval’
src/aircrack-ng.c:2225: error: ‘struct options’ has no member named ‘l33t’
src/aircrack-ng.c:2225: warning: incompatible implicit declaration of built-in function ‘printf’
src/aircrack-ng.c:2230: warning: incompatible implicit declaration of built-in function ‘memset’
src/aircrack-ng.c:2231: warning: incompatible implicit declaration of built-in function ‘memcpy’
src/aircrack-ng.c:2231: warning: incompatible implicit declaration of built-in function ‘strlen’
src/aircrack-ng.c:2235: error: ‘struct options’ has no member named ‘l33t’
src/aircrack-ng.c:2238: error: ‘struct options’ has no member named ‘l33t’
src/aircrack-ng.c:2241: error: ‘struct options’ has no member named ‘l33t’
src/aircrack-ng.c:2248: error: ‘struct options’ has no member named ‘l33t’
src/aircrack-ng.c:2251: error: ‘struct options’ has no member named ‘l33t’
src/aircrack-ng.c:2258: error: ‘struct options’ has no member named ‘l33t’
src/aircrack-ng.c:2261: error: ‘struct options’ has no member named ‘l33t’
src/aircrack-ng.c: In function ‘next_dict’:
src/aircrack-ng.c:2270: error: ‘struct options’ has no member named ‘dict’
src/aircrack-ng.c:2270: error: ‘NULL’ undeclared (first use in this function)
src/aircrack-ng.c:2272: warning: implicit declaration of function ‘fclose’
src/aircrack-ng.c:2272: error: ‘struct options’ has no member named ‘dict’
src/aircrack-ng.c:2273: error: ‘struct options’ has no member named ‘dict’
src/aircrack-ng.c:2275: error: ‘struct options’ has no member named ‘nbdict’
src/aircrack-ng.c:2276: error: ‘struct options’ has no member named ‘nbdict’
src/aircrack-ng.c:2279: error: ‘struct options’ has no member named ‘nbdict’
src/aircrack-ng.c:2279: error: ‘struct options’ has no member named ‘nbdict’
src/aircrack-ng.c:2281: error: ‘struct options’ has no member named ‘nbdict’
src/aircrack-ng.c:2283: error: ‘struct options’ has no member named ‘dict’
src/aircrack-ng.c:2283: warning: implicit declaration of function ‘fdopen’
src/aircrack-ng.c:2286: error: ‘struct options’ has no member named ‘nbdict’
src/aircrack-ng.c:2290: error: ‘struct options’ has no member named ‘no_stdin’
src/aircrack-ng.c:2294: error: ‘struct options’ has no member named ‘dict’
src/aircrack-ng.c:2294: warning: implicit declaration of function ‘fopen’
src/aircrack-ng.c:2294: error: ‘struct options’ has no member named ‘nbdict’
src/aircrack-ng.c:2297: error: ‘struct options’ has no member named ‘nbdict’
src/aircrack-ng.c:2301: warning: implicit declaration of function ‘fseek’
src/aircrack-ng.c:2301: error: ‘struct options’ has no member named ‘dict’
src/aircrack-ng.c:2301: error: ‘SEEK_END’ undeclared (first use in this function)
src/aircrack-ng.c:2303: warning: implicit declaration of function ‘ftell’
src/aircrack-ng.c:2303: error: ‘struct options’ has no member named ‘dict’
src/aircrack-ng.c:2305: error: ‘struct options’ has no member named ‘dict’
src/aircrack-ng.c:2306: error: ‘struct options’ has no member named ‘dict’
src/aircrack-ng.c:2307: warning: incompatible implicit declaration of built-in function ‘printf’
src/aircrack-ng.c:2308: error: ‘struct options’ has no member named ‘nbdict’
src/aircrack-ng.c:2312: warning: implicit declaration of function ‘rewind’
src/aircrack-ng.c:2312: error: ‘struct options’ has no member named ‘dict’
src/aircrack-ng.c:2317: error: ‘struct options’ has no member named ‘nbdict’
src/aircrack-ng.c:2317: error: ‘struct options’ has no member named ‘nbdict’
src/aircrack-ng.c: In function ‘do_wpa_crack’:
src/aircrack-ng.c:2339: error: too many arguments to function ‘safe_write’
src/aircrack-ng.c:2342: error: ‘SIGTERM’ undeclared (first use in this function)
src/aircrack-ng.c:2343: warning: incompatible implicit declaration of built-in function ‘_exit’
src/aircrack-ng.c:2349: warning: incompatible implicit declaration of built-in function ‘memcpy’
src/aircrack-ng.c:2373: warning: incompatible implicit declaration of built-in function ‘memset’
src/aircrack-ng.c:2378: error: ‘struct options’ has no member named ‘l33t’
src/aircrack-ng.c:2379: warning: incompatible implicit declaration of built-in function ‘printf’
src/aircrack-ng.c:2383: error: ‘struct options’ has no member named ‘l33t’
src/aircrack-ng.c:2395: error: ‘struct options’ has no member named ‘dict’
src/aircrack-ng.c:2395: error: ‘NULL’ undeclared (first use in this function)
src/aircrack-ng.c:2397: warning: incompatible implicit declaration of built-in function ‘printf’
src/aircrack-ng.c:2403: warning: implicit declaration of function ‘fgets’
src/aircrack-ng.c:2403: error: ‘struct options’ has no member named ‘dict’
src/aircrack-ng.c:2405: error: ‘struct options’ has no member named ‘l33t’
src/aircrack-ng.c:2406: warning: incompatible implicit declaration of built-in function ‘printf’
src/aircrack-ng.c:2408: error: ‘struct options’ has no member named ‘nbdict’
src/aircrack-ng.c:2409: error: ‘struct options’ has no member named ‘nbdict’
src/aircrack-ng.c:2419: warning: incompatible implicit declaration of built-in function ‘strlen’
src/aircrack-ng.c:2429: error: ‘struct options’ has no member named ‘dict’
src/aircrack-ng.c:2431: error: ‘struct options’ has no member named ‘nbdict’
src/aircrack-ng.c:2441: warning: incompatible implicit declaration of built-in function ‘strlen’
src/aircrack-ng.c:2451: error: too many arguments to function ‘safe_write’
src/aircrack-ng.c:2452: error: too many arguments to function ‘safe_write’
src/aircrack-ng.c:2463: error: too many arguments to function ‘safe_read’
src/aircrack-ng.c:2464: error: too many arguments to function ‘safe_read’
src/aircrack-ng.c:2465: error: too many arguments to function ‘safe_read’
src/aircrack-ng.c:2466: error: too many arguments to function ‘safe_read’
src/aircrack-ng.c:2504: warning: incompatible implicit declaration of built-in function ‘printf’
src/aircrack-ng.c:2510: error: ‘struct options’ has no member named ‘l33t’
src/aircrack-ng.c:2511: warning: incompatible implicit declaration of built-in function ‘printf’
src/aircrack-ng.c:2514: warning: incompatible implicit declaration of built-in function ‘strlen’
src/aircrack-ng.c:2516: error: ‘struct options’ has no member named ‘l33t’
src/aircrack-ng.c: In function ‘sighandler’:
src/aircrack-ng.c:2540: warning: implicit declaration of function ‘signal’
src/aircrack-ng.c:2542: error: ‘SIGQUIT’ undeclared (first use in this function)
src/aircrack-ng.c:2543: warning: incompatible implicit declaration of built-in function ‘_exit’
src/aircrack-ng.c:2545: error: ‘SIGTERM’ undeclared (first use in this function)
src/aircrack-ng.c:2548: error: ‘SIGINT’ undeclared (first use in this function)
src/aircrack-ng.c:2555: error: ‘SIGWINCH’ undeclared (first use in this function)
src/aircrack-ng.c:2556: warning: incompatible implicit declaration of built-in function ‘printf’
src/aircrack-ng.c: In function ‘next_key’:
src/aircrack-ng.c:2566: warning: incompatible implicit declaration of built-in function ‘malloc’
src/aircrack-ng.c:2572: error: ‘struct options’ has no member named ‘dict’
src/aircrack-ng.c:2572: error: ‘NULL’ undeclared (first use in this function)
src/aircrack-ng.c:2574: warning: incompatible implicit declaration of built-in function ‘printf’
src/aircrack-ng.c:2579: error: ‘struct options’ has no member named ‘hexdict’
src/aircrack-ng.c:2579: error: ‘struct options’ has no member named ‘nbdict’
src/aircrack-ng.c:2581: error: ‘struct options’ has no member named ‘dict’
src/aircrack-ng.c:2583: error: ‘struct options’ has no member named ‘l33t’
src/aircrack-ng.c:2584: warning: incompatible implicit declaration of built-in function ‘printf’
src/aircrack-ng.c:2587: error: ‘struct options’ has no member named ‘nbdict’
src/aircrack-ng.c:2598: warning: incompatible implicit declaration of built-in function ‘strlen’
src/aircrack-ng.c:2608: warning: implicit declaration of function ‘strsep’
src/aircrack-ng.c:2608: warning: assignment makes pointer from integer without a cast
src/aircrack-ng.c:2617: warning: implicit declaration of function ‘sscanf’
src/aircrack-ng.c:2617: warning: incompatible implicit declaration of built-in function ‘sscanf’
src/aircrack-ng.c:2624: warning: assignment makes pointer from integer without a cast
src/aircrack-ng.c:2634: error: ‘struct options’ has no member named ‘dict’
src/aircrack-ng.c:2636: error: ‘struct options’ has no member named ‘l33t’
src/aircrack-ng.c:2637: warning: incompatible implicit declaration of built-in function ‘printf’
src/aircrack-ng.c:2640: error: ‘struct options’ has no member named ‘nbdict’
src/aircrack-ng.c:2651: warning: incompatible implicit declaration of built-in function ‘strlen’
src/aircrack-ng.c: In function ‘set_dicts’:
src/aircrack-ng.c:2674: error: ‘struct options’ has no member named ‘nbdict’
src/aircrack-ng.c:2675: warning: assignment makes pointer from integer without a cast
src/aircrack-ng.c:2679: error: ‘NULL’ undeclared (first use in this function)
src/aircrack-ng.c:2682: error: ‘struct options’ has no member named ‘nbdict’
src/aircrack-ng.c:2684: warning: incompatible implicit declaration of built-in function ‘strlen’
src/aircrack-ng.c:2685: error: ‘struct options’ has no member named ‘nbdict’
src/aircrack-ng.c:2685: warning: incompatible implicit declaration of built-in function ‘malloc’
src/aircrack-ng.c:2686: error: ‘struct options’ has no member named ‘nbdict’
src/aircrack-ng.c:2691: warning: implicit declaration of function ‘strncasecmp’
src/aircrack-ng.c:2693: warning: incompatible implicit declaration of built-in function ‘strncpy’
src/aircrack-ng.c:2693: error: ‘struct options’ has no member named ‘nbdict’
src/aircrack-ng.c:2694: error: ‘struct options’ has no member named ‘hexdict’
src/aircrack-ng.c:2694: error: ‘struct options’ has no member named ‘nbdict’
src/aircrack-ng.c:2698: warning: incompatible implicit declaration of built-in function ‘strncpy’
src/aircrack-ng.c:2698: error: ‘struct options’ has no member named ‘nbdict’
src/aircrack-ng.c:2699: error: ‘struct options’ has no member named ‘hexdict’
src/aircrack-ng.c:2699: error: ‘struct options’ has no member named ‘nbdict’
src/aircrack-ng.c:2701: warning: assignment makes pointer from integer without a cast
src/aircrack-ng.c:2702: error: ‘struct options’ has no member named ‘nbdict’
src/aircrack-ng.c:2707: error: ‘struct options’ has no member named ‘nbdict’
src/aircrack-ng.c: In function ‘crack_wep_dict’:
src/aircrack-ng.c:2716: error: storage size of ‘t_last’ isn’t known
src/aircrack-ng.c:2717: error: storage size of ‘t_now’ isn’t known
src/aircrack-ng.c:2721: warning: incompatible implicit declaration of built-in function ‘malloc’
src/aircrack-ng.c:2728: warning: incompatible implicit declaration of built-in function ‘printf’
src/aircrack-ng.c:2732: error: ‘NULL’ undeclared (first use in this function)
src/aircrack-ng.c:2739: warning: incompatible implicit declaration of built-in function ‘strlen’
src/aircrack-ng.c:2717: warning: unused variable ‘t_now’
src/aircrack-ng.c:2716: warning: unused variable ‘t_last’
src/aircrack-ng.c: In function ‘main’:
src/aircrack-ng.c:2781: warning: incompatible implicit declaration of built-in function ‘memset’
src/aircrack-ng.c:2799: warning: incompatible implicit declaration of built-in function ‘printf’
src/aircrack-ng.c:2806: error: ‘struct options’ has no member named ‘showASCII’
src/aircrack-ng.c:2812: warning: implicit declaration of function ‘getopt’
src/aircrack-ng.c:2822: warning: incompatible implicit declaration of built-in function ‘sscanf’
src/aircrack-ng.c:2822: error: ‘optarg’ undeclared (first use in this function)
src/aircrack-ng.c:2824: warning: implicit declaration of function ‘strcasecmp’
src/aircrack-ng.c:2832: warning: incompatible implicit declaration of built-in function ‘printf’
src/aircrack-ng.c:2841: warning: incompatible implicit declaration of built-in function ‘strncpy’
src/aircrack-ng.c:2849: warning: incompatible implicit declaration of built-in function ‘printf’
src/aircrack-ng.c:2860: warning: incompatible implicit declaration of built-in function ‘printf’
src/aircrack-ng.c:2913: warning: incompatible implicit declaration of built-in function ‘printf’
src/aircrack-ng.c:2931: warning: incompatible implicit declaration of built-in function ‘printf’
src/aircrack-ng.c:2944: warning: incompatible implicit declaration of built-in function ‘printf’
src/aircrack-ng.c:2957: warning: incompatible implicit declaration of built-in function ‘printf’
src/aircrack-ng.c:2968: warning: incompatible implicit declaration of built-in function ‘printf’
src/aircrack-ng.c:2979: warning: incompatible implicit declaration of built-in function ‘printf’
src/aircrack-ng.c:2996: warning: incompatible implicit declaration of built-in function ‘printf’
src/aircrack-ng.c:3014: error: ‘struct options’ has no member named ‘showASCII’
src/aircrack-ng.c:3024: error: ‘struct options’ has no member named ‘l33t’
src/aircrack-ng.c:3031: error: ‘optind’ undeclared (first use in this function)
src/aircrack-ng.c:3034: error: ‘struct options’ has no member named ‘dict’
src/aircrack-ng.c:3034: error: ‘NULL’ undeclared (first use in this function)
src/aircrack-ng.c:3037: warning: incompatible implicit declaration of built-in function ‘printf’
src/aircrack-ng.c:3041: error: ‘struct options’ has no member named ‘no_stdin’
src/aircrack-ng.c:3043: warning: incompatible implicit declaration of built-in function ‘printf’
src/aircrack-ng.c:3049: error: ‘SIGINT’ undeclared (first use in this function)
src/aircrack-ng.c:3050: error: ‘SIGQUIT’ undeclared (first use in this function)
src/aircrack-ng.c:3051: error: ‘SIGTERM’ undeclared (first use in this function)
src/aircrack-ng.c:3052: error: ‘SIGALRM’ undeclared (first use in this function)
src/aircrack-ng.c:3052: error: ‘SIG_IGN’ undeclared (first use in this function)
src/aircrack-ng.c:3054: warning: implicit declaration of function ‘pthread_mutex_init’
src/aircrack-ng.c:3054: error: ‘mx_apl’ undeclared (first use in this function)
src/aircrack-ng.c:3055: error: ‘mx_eof’ undeclared (first use in this function)
src/aircrack-ng.c:3056: warning: implicit declaration of function ‘pthread_cond_init’
src/aircrack-ng.c:3056: error: ‘cv_eof’ undeclared (first use in this function)
src/aircrack-ng.c:3064: error: ‘pthread_t’ undeclared (first use in this function)
src/aircrack-ng.c:3064: error: expected ‘;’ before ‘tid’
src/aircrack-ng.c:3067: error: ‘struct options’ has no member named ‘no_stdin’
src/aircrack-ng.c:3069: warning: implicit declaration of function ‘pthread_create’
src/aircrack-ng.c:3069: error: ‘tid’ undeclared (first use in this function)
src/aircrack-ng.c:3086: warning: incompatible implicit declaration of built-in function ‘printf’
src/aircrack-ng.c:3087: error: ‘stdout’ undeclared (first use in this function)
src/aircrack-ng.c:3091: warning: implicit declaration of function ‘pthread_cond_wait’
src/aircrack-ng.c:3095: error: ‘struct options’ has no member named ‘no_stdin’
src/aircrack-ng.c:3096: warning: incompatible implicit declaration of built-in function ‘printf’
src/aircrack-ng.c:3099: error: ‘SIG_DFL’ undeclared (first use in this function)
src/aircrack-ng.c:3162: warning: implicit declaration of function ‘scanf’
src/aircrack-ng.c:3162: warning: incompatible implicit declaration of built-in function ‘scanf’
src/aircrack-ng.c:3164: warning: implicit declaration of function ‘atoi’
src/aircrack-ng.c:3182: warning: incompatible implicit declaration of built-in function ‘memcpy’
src/aircrack-ng.c:3238: warning: implicit declaration of function ‘pipe’
src/aircrack-ng.c:3257: error: ‘SIGWINCH’ undeclared (first use in this function)
src/aircrack-ng.c:3287: error: ‘struct options’ has no member named ‘dict’
src/aircrack-ng.c:3297: error: expected ‘;’ before ‘tid’
src/aircrack-ng.c:3370: error: ‘struct options’ has no member named ‘dict’
src/aircrack-ng.c:3398: warning: incompatible implicit declaration of built-in function ‘strncpy’
src/aircrack-ng.c:3405: error: expected ‘;’ before ‘tid’
src/aircrack-ng.c:3431: warning: incompatible implicit declaration of built-in function ‘_exit’
src/crypto.c:21:20: error: string.h: Aucun fichier ou répertoire de ce type
src/crypto.c: In function ‘md5_update’:
src/crypto.c:213: warning: implicit declaration of function ‘memcpy’
src/crypto.c:213: warning: incompatible implicit declaration of built-in function ‘memcpy’
src/crypto.c:230: warning: incompatible implicit declaration of built-in function ‘memcpy’
src/crypto.c: In function ‘hmac_md5’:
src/crypto.c:277: warning: implicit declaration of function ‘memset’
src/crypto.c:277: warning: incompatible implicit declaration of built-in function ‘memset’
src/crypto.c:280: warning: incompatible implicit declaration of built-in function ‘memcpy’
src/crypto.c: In function ‘sha1_update’:
src/crypto.c:491: warning: incompatible implicit declaration of built-in function ‘memcpy’
src/crypto.c:508: warning: incompatible implicit declaration of built-in function ‘memcpy’
src/crypto.c: In function ‘hmac_sha1’:
src/crypto.c:556: warning: incompatible implicit declaration of built-in function ‘memset’
src/crypto.c:559: warning: incompatible implicit declaration of built-in function ‘memcpy’
src/common.c:1:19: error: stdio.h: Aucun fichier ou répertoire de ce type
src/common.c:2:20: error: stdlib.h: Aucun fichier ou répertoire de ce type
src/common.c:3:20: error: string.h: Aucun fichier ou répertoire de ce type
src/common.c:4:23: error: sys/types.h: Aucun fichier ou répertoire de ce type
src/common.c:5:22: error: sys/stat.h: Aucun fichier ou répertoire de ce type
src/common.c:6:22: error: sys/wait.h: Aucun fichier ou répertoire de ce type
src/common.c:7:20: error: dirent.h: Aucun fichier ou répertoire de ce type
src/common.c:8:20: error: unistd.h: Aucun fichier ou répertoire de ce type
src/common.c:9:19: error: ctype.h: Aucun fichier ou répertoire de ce type
src/common.c: In function ‘is_ndiswrapper’:
src/common.c:15: warning: implicit declaration of function ‘fork’
src/common.c:17: warning: implicit declaration of function ‘close’
src/common.c:17: warning: implicit declaration of function ‘chdir’
src/common.c:18: warning: implicit declaration of function ‘execl’
src/common.c:18: warning: incompatible implicit declaration of built-in function ‘execl’
src/common.c:18: error: ‘NULL’ undeclared (first use in this function)
src/common.c:18: error: (Each undeclared identifier is reported only once
src/common.c:18: error: for each function it appears in.)
src/common.c:18: warning: missing sentinel in function call
src/common.c:19: warning: implicit declaration of function ‘exit’
src/common.c:19: warning: incompatible implicit declaration of built-in function ‘exit’
src/common.c:22: warning: implicit declaration of function ‘waitpid’
src/common.c:23: warning: implicit declaration of function ‘WIFEXITED’
src/common.c:23: warning: implicit declaration of function ‘WEXITSTATUS’
src/common.c: In function ‘getVersion’:
src/common.c:30: warning: implicit declaration of function ‘calloc’
src/common.c:30: warning: incompatible implicit declaration of built-in function ‘calloc’
src/common.c:31: warning: implicit declaration of function ‘strlen’
src/common.c:31: warning: incompatible implicit declaration of built-in function ‘strlen’
src/common.c:32: warning: implicit declaration of function ‘sprintf’
src/common.c:32: warning: incompatible implicit declaration of built-in function ‘sprintf’
src/common.c:35: warning: implicit declaration of function ‘strcat’
src/common.c:35: warning: incompatible implicit declaration of built-in function ‘strcat’
src/common.c:36: warning: implicit declaration of function ‘memset’
src/common.c:36: warning: incompatible implicit declaration of built-in function ‘memset’
src/common.c:40: warning: incompatible implicit declaration of built-in function ‘strcat’
src/common.c:42: warning: implicit declaration of function ‘free’
src/common.c:43: warning: implicit declaration of function ‘realloc’
src/common.c:43: warning: assignment makes pointer from integer without a cast
src/common.c: In function ‘searchInside’:
src/common.c:53: error: storage size of ‘sb’ isn’t known
src/common.c:55: error: ‘DIR’ undeclared (first use in this function)
src/common.c:55: error: ‘dp’ undeclared (first use in this function)
src/common.c:58: warning: incompatible implicit declaration of built-in function ‘strlen’
src/common.c:60: warning: incompatible implicit declaration of built-in function ‘calloc’
src/common.c:61: warning: implicit declaration of function ‘opendir’
src/common.c:62: error: ‘NULL’ undeclared (first use in this function)
src/common.c:64: warning: implicit declaration of function ‘readdir’
src/common.c:64: warning: assignment makes pointer from integer without a cast
src/common.c:67: warning: incompatible implicit declaration of built-in function ‘memset’
src/common.c:68: warning: incompatible implicit declaration of built-in function ‘sprintf’
src/common.c:68: error: dereferencing pointer to incomplete type
src/common.c:71: error: dereferencing pointer to incomplete type
src/common.c:71: warning: implicit declaration of function ‘strcmp’
src/common.c:71: error: dereferencing pointer to incomplete type
src/common.c:73: warning: implicit declaration of function ‘closedir’
src/common.c:76: warning: implicit declaration of function ‘lstat’
src/common.c:79: warning: implicit declaration of function ‘S_ISDIR’
src/common.c:79: warning: implicit declaration of function ‘S_ISLNK’
src/common.c:82: error: dereferencing pointer to incomplete type
src/common.c:82: error: dereferencing pointer to incomplete type
src/common.c:53: warning: unused variable ‘sb’
src/common.c: In function ‘wiToolsPath’:
src/common.c:118: error: ‘NULL’ undeclared (first use in this function)
src/common.c: In function ‘getmac’:
src/common.c:131: error: ‘NULL’ undeclared (first use in this function)
src/common.c:135: warning: incompatible implicit declaration of built-in function ‘strlen’
src/common.c:138: warning: incompatible implicit declaration of built-in function ‘memset’
src/common.c:147: warning: implicit declaration of function ‘sscanf’
src/common.c:147: warning: incompatible implicit declaration of built-in function ‘sscanf’
src/common.c:151: warning: implicit declaration of function ‘isdigit’
src/common.c:151: warning: implicit declaration of function ‘toupper’
make: *** [aircrack-ng] Erreur 1
[email protected]:~/Desktop/aircrack-ng-0.7$

Enfin bref que des "error" et "warning"
Et toujours le "make: *** [aircrack-ng] Erreur 1" à la fin sad (idem avec aircrack-ng ou aircrack-ptw)
Donc une foi que je lance "sh wlan0up" ou "sh wlan0down", il me répond qu'aucun périphérique ne correspond.
Quelqu'un peut-il m'aider ?

Merci wink

Dernière modification par guigui_cosmos (12-04-2007 16:32:30)


Comme dit mamie : toi tu veux tout savoir et rien payer ! big_smile

Hors Ligne

Annonce

Visitez la boutique Wifi-highpower.com, votre revendeur agr Alfa Network: du matriel Wifi slectionn, cartes Wifi USB Awus036h et Awus036nh, antennes omnis, yagis, panel, amplis wifi, accessoires...

#2 12-04-2007 16:40:24

Billyboylindien
Membre d'honneur
Inscription : 06-10-2005
Messages : 1 561
Site Web

Re : Installer drivers rtl8187 sous Ubuntu

fais ca avant

sudo apt-get install linux-headers-$(uname -r) build-essential

Et redis nous.


Les cartes wifi recommandée et testées
Billyboylindien parle d'informatique (un peu wink ).

Proposez vous aussi vos tutos sur tout les sujets (web, prog, bricolage ...)

Hors Ligne

#3 12-04-2007 16:46:10

guigui_cosmos
Membre
Inscription : 14-01-2007
Messages : 137

Re : Installer drivers rtl8187 sous Ubuntu

Ok j'avais déjà tester

sudo apt-get install build-essential

mais ça ne fonctionnait pas tongue
Que signifie les lignes que tu as rajouté ?

Dernière modification par guigui_cosmos (12-04-2007 16:46:39)


Comme dit mamie : toi tu veux tout savoir et rien payer ! big_smile

Hors Ligne

#4 12-04-2007 17:04:00

guigui_cosmos
Membre
Inscription : 14-01-2007
Messages : 137

Re : Installer drivers rtl8187 sous Ubuntu

Voilà ce qui m'a été gentillement répondu

[email protected]:~$ sudo apt-get install linux-headers-$(uname -r) build essential
Lecture des listes de paquets... Fait
Construction de l'arbre des dépendances       
Reading state information... Fait       
linux-headers-2.6.17-10-generic est déjà la plus récente version disponible.
E: Impossible de trouver le paquet build

Et toujours même souci après sad


Comme dit mamie : toi tu veux tout savoir et rien payer ! big_smile

Hors Ligne

#5 12-04-2007 17:04:59

Billyboylindien
Membre d'honneur
Inscription : 06-10-2005
Messages : 1 561
Site Web

Re : Installer drivers rtl8187 sous Ubuntu

linux-headers: c'est les header relatifs a ton noyau et "uname-r" donne la version de ton noyau, tu peux le taper seul dans la console.

Donc la combinaison install les header de ta version de noyau.


Les cartes wifi recommandée et testées
Billyboylindien parle d'informatique (un peu wink ).

Proposez vous aussi vos tutos sur tout les sujets (web, prog, bricolage ...)

Hors Ligne

#6 12-04-2007 23:00:05

CaSa
Membre
Inscription : 12-04-2007
Messages : 8

Re : Installer drivers rtl8187 sous Ubuntu

guigui_cosmos a écrit :

Voilà ce qui m'a été gentillement répondu

E: Impossible de trouver le paquet build

C'est
apt-get install build-essential
... et pas
apt-get install build essential

Hors Ligne

#7 13-04-2007 00:31:56

guigui_cosmos
Membre
Inscription : 14-01-2007
Messages : 137

Re : Installer drivers rtl8187 sous Ubuntu

Bon et bien le problème semble moins grave que prévu !
En fait c'est juste lors de l'insertion de rtl8187.ko qui foire, mais ça je sais pas comment faire hmm
J'ai essayer de le changer de place et modifier wlan0up, mais rien n'y fait.
Quelqu'un a-t-il déjà eu ce problème ?

Merci wink


Comme dit mamie : toi tu veux tout savoir et rien payer ! big_smile

Hors Ligne

#8 13-04-2007 08:45:15

CaSa
Membre
Inscription : 12-04-2007
Messages : 8

Re : Installer drivers rtl8187 sous Ubuntu

guigui_cosmos a écrit :

En fait c'est juste lors de l'insertion de rtl8187.ko qui foire, mais ça je sais pas comment faire hmm

Un message d'erreur à donner ?

Hors Ligne

#9 13-04-2007 11:08:49

guigui_cosmos
Membre
Inscription : 14-01-2007
Messages : 137

Re : Installer drivers rtl8187 sous Ubuntu

Oui voilà ce que j'obtients :

[email protected]:~/Desktop/rtl8187_linux_26.1010.0622.2006# sh wlan0up
insmod: error inserting 'ieee80211-rtl.ko': -1 File exists
insmod: error inserting 'r8187.ko': -1 File exists
[email protected]:~/Desktop/rtl8187_linux_26.1010.0622.2006# sh wlan0down
[email protected]:~/Desktop/rtl8187_linux_26.1010.0622.2006# sh wlan0up
insmod: error inserting 'r8187.ko': -1 Unknown symbol in module
wlan0: ERREUR en récupérant les signaux de l'interface: Aucun périphérique de ce type

J'ai bien essayer de l'insérer moi même avec sudo insmod r8187.ko mais rien n'y fait.


Comme dit mamie : toi tu veux tout savoir et rien payer ! big_smile

Hors Ligne

#10 16-04-2007 21:28:37

hs
Invité

Re : Installer drivers rtl8187 sous Ubuntu

salut,j ai unprobleme avec l installation des drivers rtl8187:la carte fonctionne bien en mode managed mais refuse obstinnement de passer en mode monitor et le led reste eteint.le chipset et le driver n apparaissent pas avec airmon-ng meme si le driver a l air d etre installé.si quelqu un a une idee.....merci

#11 08-05-2007 10:06:20

Mr Plumme
Membre
Inscription : 26-04-2007
Messages : 60

Re : Installer drivers rtl8187 sous Ubuntu

quelques soucis sous feisty:

[email protected]:~/rtl8187_linux_26.1010.0622.2006$ sudo sh wlan0down 
ERROR: Module r8187 does not exist in /proc/modules
[email protected]:~/rtl8187_linux_26.1010.0622.2006$ sudo sh wlan0up
insmod: error inserting 'r8187.ko': -1 File exists

Hors Ligne

#12 13-05-2007 23:26:26

Mr Plumme
Membre
Inscription : 26-04-2007
Messages : 60

Re : Installer drivers rtl8187 sous Ubuntu

Quelqu'un a réussit à la faire fonctionner sous ubuntu 7 avec l'injection:D

Hors Ligne

Annonce

Visitez la boutique Wifi-highpower.com, votre revendeur agr Alfa Network: du matriel Wifi slectionn, cartes Wifi USB Awus036h et Awus036nh, antennes omnis, yagis, panel, amplis wifi, accessoires...

Sujets similaires